Reaction Details
TargetCytochrome P450 11B1, mitochondrial
LigandBDBM9920
Substrate/Competitorn/a
Meas. Tech.ChEMBL_1456059 (CHEMBL3366443)
IC50 171±n/a nM
Citation Hu, QYin, LHartmann, RW Aldosterone synthase inhibitors as promising treatments for mineralocorticoid dependent cardiovascular and renal diseases. J Med Chem57:5011-22 (2014) 
 
Cytochrome P450 11B1, mitochondrial
Name:Cytochrome P450 11B1, mitochondrial
Type:Enzyme
Mol. Mass.:57591.44
Organism:Homo sapiens (Human)
Description:P15538
Residue:503
BDBM9920
NameBDBM9920
Synonyms:(S)Fadrozole 4-[(5S)-5H,6H,7H,8H-imidazo[1,5-a]pyridin-5-yl]benzonitrile | CHEMBL31215
TypeSmall organic molecule
Emp. Form.C14H13N3
Mol. Mass.223.2731
SMILESN#Cc1ccc(cc1)[C@@H]1CCCc2cncn12