Reaction Details
TargetNuclear receptor ROR-alpha
LigandBDBM50444338
Substrate/Competitorn/a
Meas. Tech.ChEMBL_1457051 (CHEMBL3368936)
Ki 172±n/a nM
Citation Fauber, BPMagnuson, S Modulators of the nuclear receptor retinoic acid receptor-related orphan receptor-¿ (ROR¿ or RORc). J Med Chem57:5871-92 (2014) 
 
Nuclear receptor ROR-alpha
Name:Nuclear receptor ROR-alpha
Type:PROTEIN
Mol. Mass.:58976.26
Organism:Homo sapiens (Human)
Description:ChEMBL_101591
Residue:523
BDBM50444338
NameBDBM50444338
Synonyms:CHEMBL3094388
TypeSmall organic molecule
Emp. Form.C15H13F6N3O4S2
Mol. Mass.477.402
SMILESCC(=O)Nc1nc(C)c(s1)S(=O)(=O)Nc1ccc(cc1)C(O)(C(F)(F)F)C(F)(F)F