Reaction Details
TargetNuclear receptor ROR-alpha
LigandBDBM19993
Substrate/Competitorn/a
Meas. Tech.ChEMBL_1457939 (CHEMBL3370846)
EC50 5000±n/a nM
Citation Fauber, BPMagnuson, S Modulators of the nuclear receptor retinoic acid receptor-related orphan receptor-¿ (ROR¿ or RORc). J Med Chem57:5871-92 (2014) 
 
Nuclear receptor ROR-alpha
Name:Nuclear receptor ROR-alpha
Type:PROTEIN
Mol. Mass.:58976.26
Organism:Homo sapiens (Human)
Description:ChEMBL_101591
Residue:523
BDBM19993
NameBDBM19993
Synonyms:CHEMBL62136 T 0901317 TO-901317 US10669296, Compound TO901317 [3H]T0901317
TypeSmall organic molecule
Emp. Form.C17H12F9NO3S
Mol. Mass.481.333
SMILESOC(c1ccc(cc1)N(CC(F)(F)F)S(=O)(=O)c1ccccc1)(C(F)(F)F)C(F)(F)F