Reaction Details
TargetPhosphatidylinositol 4,5-bisphosphate 3-kinase catalytic subunit alpha isoform
LigandBDBM50044281
Substrate/Competitorn/a
Meas. Tech.ChEMBL_1450783 (CHEMBL3363928)
Ki 7.0±n/a nM
Citation Collier, PNMartinez-Botella, GCornebise, MCottrell, KMDoran, JDGriffith, JPMahajan, SMaltais, FMoody, CSHuck, EPWang, TAronov, AM Structural basis for isoform selectivity in a class of benzothiazole inhibitors of phosphoinositide 3-kinase¿. J Med Chem58:517-21 (2015) 
 
Phosphatidylinositol 4,5-bisphosphate 3-kinase catalytic subunit alpha isoform
Name:Phosphatidylinositol 4,5-bisphosphate 3-kinase catalytic subunit alpha isoform
Type:Enzyme Subunit
Mol. Mass.:124294.87
Organism:Homo sapiens (Human)
Description:P42336
Residue:1068
BDBM50044281
NameBDBM50044281
Synonyms:CHEMBL3356895
TypeSmall organic molecule
Emp. Form.C18H16F3N5O3S
Mol. Mass.439.412
SMILESCOc1cncc(c1)-c1ccc2nc(NC(=O)NCC(=O)NCC(F)(F)F)sc2c1