Reaction Details
TargetPhosphatidylinositol 4,5-bisphosphate 3-kinase catalytic subunit gamma isoform
LigandBDBM50044279
Substrate/Competitorn/a
Meas. Tech.ChEMBL_1450782 (CHEMBL3363927)
Ki 5.0±n/a nM
Citation Collier, PNMartinez-Botella, GCornebise, MCottrell, KMDoran, JDGriffith, JPMahajan, SMaltais, FMoody, CSHuck, EPWang, TAronov, AM Structural basis for isoform selectivity in a class of benzothiazole inhibitors of phosphoinositide 3-kinase¿. J Med Chem58:517-21 (2015) 
 
Phosphatidylinositol 4,5-bisphosphate 3-kinase catalytic subunit gamma isoform
Name:Phosphatidylinositol 4,5-bisphosphate 3-kinase catalytic subunit gamma isoform
Type:Enzyme Subunit
Mol. Mass.:126470.30
Organism:Homo sapiens (Human)
Description:P48736
Residue:1102
BDBM50044279
NameBDBM50044279
Synonyms:CHEMBL3356897
TypeSmall organic molecule
Emp. Form.C19H18N6O2S
Mol. Mass.394.45
SMILESCOc1cncc(c1)-c1ccc2nc(NC(=O)NCCc3c[nH]cn3)sc2c1