Reaction Details
TargetPhosphatidylinositol 4,5-bisphosphate 3-kinase catalytic subunit gamma isoform
LigandBDBM50044288
Substrate/Competitorn/a
Meas. Tech.ChEMBL_1450782 (CHEMBL3363927)
Ki 21±n/a nM
Citation Collier, PNMartinez-Botella, GCornebise, MCottrell, KMDoran, JDGriffith, JPMahajan, SMaltais, FMoody, CSHuck, EPWang, TAronov, AM Structural basis for isoform selectivity in a class of benzothiazole inhibitors of phosphoinositide 3-kinase¿. J Med Chem58:517-21 (2015) 
 
Phosphatidylinositol 4,5-bisphosphate 3-kinase catalytic subunit gamma isoform
Name:Phosphatidylinositol 4,5-bisphosphate 3-kinase catalytic subunit gamma isoform
Type:Enzyme Subunit
Mol. Mass.:126470.30
Organism:Homo sapiens (Human)
Description:P48736
Residue:1102
BDBM50044288
NameBDBM50044288
Synonyms:CHEMBL3356891
TypeSmall organic molecule
Emp. Form.C16H11N5OS
Mol. Mass.321.356
SMILESCC(=O)Nc1nc2ccc(cc2s1)-c1cnc2nccnc2c1