Reaction Details
TargetPhosphatidylinositol 4,5-bisphosphate 3-kinase catalytic subunit gamma isoform
LigandBDBM50042924
Substrate/Competitorn/a
Meas. Tech.ChEMBL_1450781 (CHEMBL3363926)
Ki 7.0±n/a nM
Citation Collier, PNMartinez-Botella, GCornebise, MCottrell, KMDoran, JDGriffith, JPMahajan, SMaltais, FMoody, CSHuck, EPWang, TAronov, AM Structural basis for isoform selectivity in a class of benzothiazole inhibitors of phosphoinositide 3-kinase¿. J Med Chem58:517-21 (2015) 
 
Phosphatidylinositol 4,5-bisphosphate 3-kinase catalytic subunit gamma isoform
Name:Phosphatidylinositol 4,5-bisphosphate 3-kinase catalytic subunit gamma isoform
Type:Enzyme Subunit
Mol. Mass.:126470.30
Organism:Homo sapiens (Human)
Description:P48736
Residue:1102
BDBM50042924
NameBDBM50042924
Synonyms:CHEMBL1229535
TypeSmall organic molecule
Emp. Form.C14H16ClN3O4S2
Mol. Mass.389.878
SMILESCC(=O)\N=c1\[nH]c(C)c(s1)-c1ccc(Cl)c(c1)S(=O)(=O)NCCO