Reaction Details
TargetHepatocyte growth factor receptor
LigandBDBM50044302
Substrate/Competitorn/a
Meas. Tech.ChEMBL_1450832 (CHEMBL3364271)
IC50 7.5±n/a nM
Citation Song, ZYang, YLiu, ZPeng, XGuo, JYang, XWu, KAi, JDing, JGeng, MZhang, A Discovery of novel 2,4-diarylaminopyrimidine analogues (DAAPalogues) showing potent inhibitory activities against both wild-type and mutant ALK kinases. J Med Chem58:197-211 (2015) 
 
Hepatocyte growth factor receptor
Name:Hepatocyte growth factor receptor
Type:Protein
Mol. Mass.:155559.73
Organism:Homo sapiens (Human)
Description:P08581
Residue:1390
BDBM50044302
NameBDBM50044302
Synonyms:CHEMBL3357438
TypeSmall organic molecule
Emp. Form.C25H28ClFN8O3
Mol. Mass.542.993
SMILESCNC(=O)c1cccc(F)c1Nc1nc(Nc2cccc(NC(=O)CNC(=O)NC(C)(C)C)c2)ncc1Cl