Reaction Details
TargetHepatocyte growth factor receptor
LigandBDBM50044305
Substrate/Competitorn/a
Meas. Tech.ChEMBL_1450832 (CHEMBL3364271)
IC50 120±n/a nM
Citation Song, ZYang, YLiu, ZPeng, XGuo, JYang, XWu, KAi, JDing, JGeng, MZhang, A Discovery of novel 2,4-diarylaminopyrimidine analogues (DAAPalogues) showing potent inhibitory activities against both wild-type and mutant ALK kinases. J Med Chem58:197-211 (2015) 
 
Hepatocyte growth factor receptor
Name:Hepatocyte growth factor receptor
Type:Protein
Mol. Mass.:155559.73
Organism:Homo sapiens (Human)
Description:P08581
Residue:1390
BDBM50044305
NameBDBM50044305
Synonyms:CHEMBL3357441
TypeSmall organic molecule
Emp. Form.C19H20ClN7O3S
Mol. Mass.461.925
SMILESCS(=O)(=O)Nc1ccccc1Nc1nc(Nc2cccc(NC(=O)CN)c2)ncc1Cl