Reaction Details
TargetALK tyrosine kinase receptor
LigandBDBM50044304
Substrate/Competitorn/a
Meas. Tech.ChEMBL_1450833 (CHEMBL3364272)
IC50 111±n/a nM
Citation Song, ZYang, YLiu, ZPeng, XGuo, JYang, XWu, KAi, JDing, JGeng, MZhang, A Discovery of novel 2,4-diarylaminopyrimidine analogues (DAAPalogues) showing potent inhibitory activities against both wild-type and mutant ALK kinases. J Med Chem58:197-211 (2015) 
 
ALK tyrosine kinase receptor
Name:ALK tyrosine kinase receptor
Type:Protein
Mol. Mass.:176453.10
Organism:Homo sapiens (Human)
Description:Q9UM73
Residue:1620
BDBM50044304
NameBDBM50044304
Synonyms:CHEMBL3357440
TypeSmall organic molecule
Emp. Form.C21H24ClN7O2
Mol. Mass.441.914
SMILES[H][C@@]12C[C@@]([H])(C=C1)[C@@H]([C@@H]2Nc1nc(Nc2cccc(NC(=O)CN)c2)ncc1Cl)C(=O)NC