Reaction Details
TargetPlatelet-derived growth factor receptor beta
LigandBDBM50044303
Substrate/Competitorn/a
Meas. Tech.ChEMBL_1451677 (CHEMBL3366508)
IC50>1000±n/a nM
Citation Song, ZYang, YLiu, ZPeng, XGuo, JYang, XWu, KAi, JDing, JGeng, MZhang, A Discovery of novel 2,4-diarylaminopyrimidine analogues (DAAPalogues) showing potent inhibitory activities against both wild-type and mutant ALK kinases. J Med Chem58:197-211 (2015) 
 
Platelet-derived growth factor receptor beta
Name:Platelet-derived growth factor receptor beta
Type:Enzyme
Mol. Mass.:123922.25
Organism:Homo sapiens (Human)
Description:P09619
Residue:1106
BDBM50044303
NameBDBM50044303
Synonyms:CHEMBL3357439
TypeSmall organic molecule
Emp. Form.C21H23ClN6O3S
Mol. Mass.474.964
SMILESCC(C)S(=O)(=O)c1ccccc1Nc1nc(Nc2cccc(NC(=O)CN)c2)ncc1Cl