Reaction Details
TargetALK tyrosine kinase receptor
LigandBDBM50044471
Substrate/Competitorn/a
Meas. Tech.ChEMBL_1450833 (CHEMBL3364272)
IC50 95±n/a nM
Citation Song, ZYang, YLiu, ZPeng, XGuo, JYang, XWu, KAi, JDing, JGeng, MZhang, A Discovery of novel 2,4-diarylaminopyrimidine analogues (DAAPalogues) showing potent inhibitory activities against both wild-type and mutant ALK kinases. J Med Chem58:197-211 (2015) 
 
ALK tyrosine kinase receptor
Name:ALK tyrosine kinase receptor
Type:Protein
Mol. Mass.:176453.10
Organism:Homo sapiens (Human)
Description:Q9UM73
Residue:1620
BDBM50044471
NameBDBM50044471
Synonyms:CHEMBL3357466
TypeSmall organic molecule
Emp. Form.C29H27ClN6O3S
Mol. Mass.575.081
SMILESCC(C)S(=O)(=O)c1ccccc1Nc1nc(Nc2cccc(NC(=O)Cc3cc4ccccc4[nH]3)c2)ncc1Cl