Reaction Details
TargetAcetylcholinesterase
LigandBDBM50060582
Substrate/Competitorn/a
Meas. Tech.ChEMBL_1454323 (CHEMBL3364163)
IC50 1000±n/a nM
Citation Abet, VMariani, ATruscott, FRBritton, SRodriguez, R Biased and unbiased strategies to identify biologically active small molecules. Bioorg Med Chem22:4474-89 (2014) 
 
Acetylcholinesterase
Name:Acetylcholinesterase
Type:Enzyme
Mol. Mass.:67792.70
Organism:Homo sapiens (Human)
Description:P22303
Residue:614
BDBM50060582
NameBDBM50060582
Synonyms:1,10-Bis(trimethyl ammonium)decane dibromide CHEMBL1134 DECAMETHONIUM BROMIDE N,N,N'',N''-Tetramethyl-decane-1,10-diammonium; dibromide Syncurine | decane-1,10-bis(trimethylammonium bromide)
TypeSmall organic molecule
Emp. Form.C16H38N2
Mol. Mass.258.4852
SMILESC[N+](C)(C)CCCCCCCCCC[N+](C)(C)C