Reaction Details
TargetTranscription factor Jun
LigandBDBM50044553
Substrate/Competitorn/a
Meas. Tech.ChEMBL_1458002 (CHEMBL3367176)
IC50 500±n/a nM
Citation Ye, NDing, YWild, CShen, QZhou, J Small molecule inhibitors targeting activator protein 1 (AP-1). J Med Chem57:6930-48 (2014) 
 
Transcription factor Jun
Name:Transcription factor Jun
Type:n/a
Mol. Mass.:35683.24
Organism:Homo sapiens (Human)
Description:P05412
Residue:331
BDBM50044553
NameBDBM50044553
Synonyms:CHEMBL3341956
TypeSmall organic molecule
Emp. Form.C25H20N4O2S
Mol. Mass.440.517
SMILESCNc1nc(c(s1)-c1nc2ccccc2c(=O)n1-c1ccccc1OC)-c1ccccc1