Reaction Details
TargetTranscription factor Jun
LigandBDBM50349194
Substrate/Competitorn/a
Meas. Tech.ChEMBL_1458011 (CHEMBL3367185)
EC50 1490±n/a nM
Citation Ye, NDing, YWild, CShen, QZhou, J Small molecule inhibitors targeting activator protein 1 (AP-1). J Med Chem57:6930-48 (2014) 
 
Transcription factor Jun
Name:Transcription factor Jun
Type:n/a
Mol. Mass.:35683.24
Organism:Homo sapiens (Human)
Description:P05412
Residue:331
BDBM50349194
NameBDBM50349194
Synonyms:GLAUCARUBINONE | NSC-14975
TypeSmall organic molecule
Emp. Form.C25H34O10
Mol. Mass.494.5315
SMILESCC[C@](C)(O)C(=O)O[C@@H]1[C@H]2[C@@H](C)[C@@H](O)[C@]3(O)OC[C@@]22[C@H]3[C@]3(C)[C@@H](C[C@H]2OC1=O)C(C)CC(=O)C3=O