Reaction Details
TargetTranscription factor Jun
LigandBDBM50044559
Substrate/Competitorn/a
Meas. Tech.ChEMBL_1458013 (CHEMBL3367187)
IC50 29000±n/a nM
Citation Ye, NDing, YWild, CShen, QZhou, J Small molecule inhibitors targeting activator protein 1 (AP-1). J Med Chem57:6930-48 (2014) 
 
Transcription factor Jun
Name:Transcription factor Jun
Type:n/a
Mol. Mass.:35683.24
Organism:Homo sapiens (Human)
Description:P05412
Residue:331
BDBM50044559
NameBDBM50044559
Synonyms:CHEMBL3341760
TypeSmall organic molecule
Emp. Form.C27H30O17
Mol. Mass.626.5169
SMILES[H][C@@]12O[C@]1([H])[C@](O)(C(=O)O\C=C(/C(O)=O)c1ccc(O)c(OC)c1)[C@@]1([H])[C@H](O[C@]3([H])O[C@H](CO)[C@@H](O)[C@H](O)[C@H]3O)OC=C(C(=O)OC)[C@@]21[H]