Reaction Details
TargetTranscription factor Jun
LigandBDBM50135482
Substrate/Competitorn/a
Meas. Tech.ChEMBL_1457997 (CHEMBL3367171)
IC50 8.0±n/a nM
Citation Ye, NDing, YWild, CShen, QZhou, J Small molecule inhibitors targeting activator protein 1 (AP-1). J Med Chem57:6930-48 (2014) 
 
Transcription factor Jun
Name:Transcription factor Jun
Type:n/a
Mol. Mass.:35683.24
Organism:Homo sapiens (Human)
Description:P05412
Residue:331
BDBM50135482
NameBDBM50135482
Synonyms:1-(5-Methoxy-2-thiophen-2-yl-quinazolin-4-ylamino)-3-methyl-pyrrole-2,5-dione CHEMBL129857
TypeSmall organic molecule
Emp. Form.C18H14N4O3S
Mol. Mass.366.394
SMILESCOc1cccc2nc(nc(NN3C(=O)C=C(C)C3=O)c12)-c1cccs1