Reaction Details
TargetTranscription factor Jun
LigandBDBM50090444
Substrate/Competitorn/a
Meas. Tech.ChEMBL_1457997 (CHEMBL3367171)
IC50 100±n/a nM
Citation Ye, NDing, YWild, CShen, QZhou, J Small molecule inhibitors targeting activator protein 1 (AP-1). J Med Chem57:6930-48 (2014) 
 
Transcription factor Jun
Name:Transcription factor Jun
Type:n/a
Mol. Mass.:35683.24
Organism:Homo sapiens (Human)
Description:P05412
Residue:331
BDBM50090444
NameBDBM50090444
Synonyms:4-(3-Methyl-2,5-dioxo-2,5-dihydro-pyrrol-1-ylamino)-2-phenyl-pyrimidine-5-carboxylic acid ethyl ester ethyl 4-(3-methyl-2,5-dioxo-2H-pyrrol-1(5H)-ylamino)-2-phenylpyrimidine-5-carboxylate
TypeSmall organic molecule
Emp. Form.C18H16N4O4
Mol. Mass.352.344
SMILESCCOC(=O)c1cnc(nc1NN1C(=O)C=C(C)C1=O)-c1ccccc1