Reaction Details
TargetTranscription factor Jun
LigandBDBM50044567
Substrate/Competitorn/a
Meas. Tech.ChEMBL_1457997 (CHEMBL3367171)
IC50 45±n/a nM
Citation Ye, NDing, YWild, CShen, QZhou, J Small molecule inhibitors targeting activator protein 1 (AP-1). J Med Chem57:6930-48 (2014) 
 
Transcription factor Jun
Name:Transcription factor Jun
Type:n/a
Mol. Mass.:35683.24
Organism:Homo sapiens (Human)
Description:P05412
Residue:331
BDBM50044567
NameBDBM50044567
Synonyms:CHEMBL86615
TypeSmall organic molecule
Emp. Form.C17H16N4O4S
Mol. Mass.372.398
SMILESCCOC(=O)c1cnc(NN2C(=O)C=C(C)C2=O)nc1-c1ccc(C)s1