Reaction Details
TargetTranscription factor Jun
LigandBDBM50044571
Substrate/Competitorn/a
Meas. Tech.ChEMBL_1457997 (CHEMBL3367171)
IC50 2000±n/a nM
Citation Ye, NDing, YWild, CShen, QZhou, J Small molecule inhibitors targeting activator protein 1 (AP-1). J Med Chem57:6930-48 (2014) 
 
Transcription factor Jun
Name:Transcription factor Jun
Type:n/a
Mol. Mass.:35683.24
Organism:Homo sapiens (Human)
Description:P05412
Residue:331
BDBM50044571
NameBDBM50044571
Synonyms:CHEMBL87572
TypeSmall organic molecule
Emp. Form.C13H11F3N4O4
Mol. Mass.344.246
SMILESCCOC(=O)c1cnc(NN2C(=O)C=C(C)C2=O)nc1C(F)(F)F