Reaction Details
TargetTranscription factor Jun
LigandBDBM50044578
Substrate/Competitorn/a
Meas. Tech.ChEMBL_1457997 (CHEMBL3367171)
IC50 9400±n/a nM
Citation Ye, NDing, YWild, CShen, QZhou, J Small molecule inhibitors targeting activator protein 1 (AP-1). J Med Chem57:6930-48 (2014) 
 
Transcription factor Jun
Name:Transcription factor Jun
Type:n/a
Mol. Mass.:35683.24
Organism:Homo sapiens (Human)
Description:P05412
Residue:331
BDBM50044578
NameBDBM50044578
Synonyms:CHEMBL3341907
TypeSmall organic molecule
Emp. Form.C15H6ClF6N3O2
Mol. Mass.409.67
SMILESFC(F)(F)c1cc(CN2C(=O)c3cnc(Cl)nc3C2=O)cc(c1)C(F)(F)F