Reaction Details
TargetTranscription factor Jun
LigandBDBM50092878
Substrate/Competitorn/a
Meas. Tech.ChEMBL_1457997 (CHEMBL3367171)
IC50 1700±n/a nM
Citation Ye, NDing, YWild, CShen, QZhou, J Small molecule inhibitors targeting activator protein 1 (AP-1). J Med Chem57:6930-48 (2014) 
 
Transcription factor Jun
Name:Transcription factor Jun
Type:n/a
Mol. Mass.:35683.24
Organism:Homo sapiens (Human)
Description:P05412
Residue:331
BDBM50092878
NameBDBM50092878
Synonyms:6-Chloro-pyridazine-3-carboxylic acid (3,5-bis-trifluoromethyl-phenyl)-amide | CHEMBL338934
TypeSmall organic molecule
Emp. Form.C13H6ClF6N3O
Mol. Mass.369.65
SMILESFC(F)(F)c1cc(NC(=O)c2ccc(Cl)nn2)cc(c1)C(F)(F)F