Reaction Details
TargetTranscription factor Jun
LigandBDBM50044582
Substrate/Competitorn/a
Meas. Tech.ChEMBL_1457997 (CHEMBL3367171)
IC50>10000±n/a nM
Citation Ye, NDing, YWild, CShen, QZhou, J Small molecule inhibitors targeting activator protein 1 (AP-1). J Med Chem57:6930-48 (2014) 
 
Transcription factor Jun
Name:Transcription factor Jun
Type:n/a
Mol. Mass.:35683.24
Organism:Homo sapiens (Human)
Description:P05412
Residue:331
BDBM50044582
NameBDBM50044582
Synonyms:CHEMBL3341902
TypeSmall organic molecule
Emp. Form.C14H5ClF9N3O
Mol. Mass.437.648
SMILESFC(F)(F)c1ccc(NC(=O)c2cc(nc(Cl)n2)C(F)(F)F)c(c1)C(F)(F)F