Reaction Details
Target5-hydroxytryptamine receptor 6
LigandBDBM50419052
Substrate/Competitorn/a
Meas. Tech.ChEMBL_1459806 (CHEMBL3371192)
Ki 0.700000±n/a nM
Citation Benhamú, BMartín-Fontecha, MVázquez-Villa, HPardo, LLópez-Rodríguez, ML Serotonin 5-HT6 receptor antagonists for the treatment of cognitive deficiency in Alzheimer's disease. J Med Chem57:7160-81 (2014) 
 
5-hydroxytryptamine receptor 6
Name:5-hydroxytryptamine receptor 6
Type:G Protein-Coupled Receptor (GPCR)
Mol. Mass.:46968.43
Organism:Homo sapiens (Human)
Description:P50406
Residue:440
BDBM50419052
NameBDBM50419052
Synonyms:SB-399885
TypeSmall organic molecule
Emp. Form.C18H21Cl2N3O4S
Mol. Mass.446.348
SMILESCOc1ccc(cc1N1CCNCC1)S(=O)(=O)Nc1cc(Cl)cc(Cl)c1OC