Reaction Details
Target5-hydroxytryptamine receptor 6
LigandBDBM50304003
Substrate/Competitorn/a
Meas. Tech.ChEMBL_1459806 (CHEMBL3371192)
Ki 13±n/a nM
Citation Benhamú, BMartín-Fontecha, MVázquez-Villa, HPardo, LLópez-Rodríguez, ML Serotonin 5-HT6 receptor antagonists for the treatment of cognitive deficiency in Alzheimer's disease. J Med Chem57:7160-81 (2014) 
 
5-hydroxytryptamine receptor 6
Name:5-hydroxytryptamine receptor 6
Type:G Protein-Coupled Receptor (GPCR)
Mol. Mass.:46968.43
Organism:Homo sapiens (Human)
Description:P50406
Residue:440
BDBM50304003
NameBDBM50304003
Synonyms:1-Naphthyl(4-piperazin-1-yl-1H-benzimidazol-2-yl)methanone | CHEMBL566213
TypeSmall organic molecule
Emp. Form.C22H20N4O
Mol. Mass.356.4204
SMILESO=C(c1nc2c(cccc2[nH]1)N1CCNCC1)c1cccc2ccccc12