Reaction Details
TargetDNA repair and recombination protein RAD54-like
LigandBDBM50447758
Substrate/Competitorn/a
Meas. Tech.ChEMBL_1446569 (CHEMBL3377968)
EC50 16500±n/a nM
Citation Huang, FMazin, AV Targeting the homologous recombination pathway by small molecule modulators. Bioorg Med Chem Lett24:3006-13 (2014) 
 
DNA repair and recombination protein RAD54-like
Name:DNA repair and recombination protein RAD54-like
Type:PROTEIN
Mol. Mass.:84374.70
Organism:Homo sapiens (Human)
Description:ChEMBL_105125
Residue:747
BDBM50447758
NameBDBM50447758
Synonyms:CHEBI:9287 Nigrin Streptonigrin
TypeSmall organic molecule
Emp. Form.C25H22N4O8
Mol. Mass.506.4642
SMILESCOC1=C(N)C(=O)c2nc(ccc2C1=O)-c1nc(C(O)=O)c(C)c(c1N)-c1ccc(OC)c(OC)c1O