Reaction Details
TargetPotassium voltage-gated channel subfamily H member 2
LigandBDBM50044629
Substrate/Competitorn/a
Meas. Tech.ChEMBL_1447392 (CHEMBL3380409)
IC50 2890±n/a nM
Citation Takai, KInoue, YKonishi, YSuwa, AUruno, YMatsuda, HNakako, TSakai, MNishikawa, HHashimoto, GEnomoto, TKitamura, AUematsu, YKiyoshi, ASumiyoshi, T Discovery of N-substituted 7-azaindoline derivatives as potent, orally available M1 and M4 muscarinic acetylcholine receptors selective agonists. Bioorg Med Chem Lett24:3189-93 (2014) 
 
Potassium voltage-gated channel subfamily H member 2
Name:Potassium voltage-gated channel subfamily H member 2
Type:Multi-pass membrane protein
Mol. Mass.:126672.65
Organism:Homo sapiens (Human)
Description:Q12809
Residue:1159
BDBM50044629
NameBDBM50044629
Synonyms:CHEMBL2407174
TypeSmall organic molecule
Emp. Form.C23H34N4O3
Mol. Mass.414.5411
SMILESCCOC(=O)N1CCC(CN2CCC3(CC2)CC(=O)N(CC)c2ncccc32)CC1