Reaction Details
TargetHistone deacetylase 9
LigandBDBM50044643
Substrate/Competitorn/a
Meas. Tech.ChEMBL_1450061 (CHEMBL3373902)
IC50 46±n/a nM
Citation Tashima, TMurata, HKodama, H Design and synthesis of novel and highly-active pan-histone deacetylase (pan-HDAC) inhibitors. Bioorg Med Chem22:3720-31 (2014) 
 
Histone deacetylase 9
Name:Histone deacetylase 9
Type:Enzyme
Mol. Mass.:111304.31
Organism:Homo sapiens (Human)
Description:Q9UKV0
Residue:1011
BDBM50044643
NameBDBM50044643
Synonyms:CHEMBL3311471
TypeSmall organic molecule
Emp. Form.C17H21N3O4
Mol. Mass.331.3663
SMILESONC(=O)CCCCCCNC(=O)c1ccc2[nH]c(=O)ccc2c1