Reaction Details
TargetHistone deacetylase 9
LigandBDBM50044648
Substrate/Competitorn/a
Meas. Tech.ChEMBL_1450061 (CHEMBL3373902)
IC50 34±n/a nM
Citation Tashima, TMurata, HKodama, H Design and synthesis of novel and highly-active pan-histone deacetylase (pan-HDAC) inhibitors. Bioorg Med Chem22:3720-31 (2014) 
 
Histone deacetylase 9
Name:Histone deacetylase 9
Type:Enzyme
Mol. Mass.:111304.31
Organism:Homo sapiens (Human)
Description:Q9UKV0
Residue:1011
BDBM50044648
NameBDBM50044648
Synonyms:CHEMBL3309288
TypeSmall organic molecule
Emp. Form.C18H23N3O4
Mol. Mass.345.3929
SMILESCOc1ccc2cc(ccc2n1)C(=O)NCCCCCCC(=O)NO