Reaction Details
TargetSerine/threonine-protein kinase PLK2
LigandBDBM50437838
Substrate/Competitorn/a
Meas. Tech.ChEMBL_1450868 (CHEMBL3364627)
IC50>100000±n/a nM
Citation Sampson, PBLiu, YPatel, NKFeher, MForrest, BLi, SWEdwards, LLaufer, RLang, YBan, FAwrey, DEMao, GPlotnikova, OLeung, GHodgson, RMason, JMWei, XKiarash, RGreen, EQiu, WChirgadze, NYMak, TWPan, GPauls, HW The discovery of Polo-like kinase 4 inhibitors: design and optimization of spiro[cyclopropane-1,3'[3H]indol]-2'(1'H).ones as orally bioavailable antitumor agents. J Med Chem58:130-46 (2015) 
 
Serine/threonine-protein kinase PLK2
Name:Serine/threonine-protein kinase PLK2
Type:Serine/threonine-protein kinase
Mol. Mass.:78259.87
Organism:Homo sapiens (Human)
Description:Full-length human PLK2 was expressed as GST-fusion protein using baculovirus expression system. GST-PLK2 was purified by using glutathione sepharose chromatography.
Residue:685
BDBM50437838
NameBDBM50437838
Synonyms:CHEMBL2407749
TypeSmall organic molecule
Emp. Form.C23H16N4O
Mol. Mass.364.3993
SMILESO=C1Nc2ccccc2\C1=C/c1ccc2c(\C=C\c3ccncc3)n[nH]c2c1