Reaction Details
TargetSerine/threonine-protein kinase PLK4
LigandBDBM50044650
Substrate/Competitorn/a
Meas. Tech.ChEMBL_1450851 (CHEMBL3364610)
IC50 1.2±n/a nM
Citation Sampson, PBLiu, YPatel, NKFeher, MForrest, BLi, SWEdwards, LLaufer, RLang, YBan, FAwrey, DEMao, GPlotnikova, OLeung, GHodgson, RMason, JMWei, XKiarash, RGreen, EQiu, WChirgadze, NYMak, TWPan, GPauls, HW The discovery of Polo-like kinase 4 inhibitors: design and optimization of spiro[cyclopropane-1,3'[3H]indol]-2'(1'H).ones as orally bioavailable antitumor agents. J Med Chem58:130-46 (2015) 
 
Serine/threonine-protein kinase PLK4
Name:Serine/threonine-protein kinase PLK4
Type:PROTEIN
Mol. Mass.:108996.91
Organism:Homo sapiens (Human)
Description:ChEMBL_1474078
Residue:970
BDBM50044650
NameBDBM50044650
Synonyms:CHEMBL3353350
TypeSmall organic molecule
Emp. Form.C28H25ClN4O
Mol. Mass.468.977
SMILESCN(C)Cc1ccc(\C=C\c2n[nH]c3cc(ccc23)[C@@H]2C[C@@]22C(=O)Nc3ccc(Cl)cc23)cc1