Reaction Details
TargetRAF proto-oncogene serine/threonine-protein kinase
LigandBDBM50085415
Substrate/Competitorn/a
Meas. Tech.ChEMBL_1452618 (CHEMBL3363743)
IC50 4.4±n/a nM
Citation Kim, MLee, JJung, KKim, HAman, WRyu, JSHah, JM Design, synthesis and biological evaluation of benzyl 2-(1H-imidazole-1-yl) pyrimidine analogues as selective and potent Raf inhibitors. Bioorg Med Chem Lett24:3600-4 (2014) 
 
RAF proto-oncogene serine/threonine-protein kinase
Name:RAF proto-oncogene serine/threonine-protein kinase
Type:Serine/threonine-protein kinase
Mol. Mass.:73082.52
Organism:Homo sapiens (Human)
Description:P04049
Residue:648
BDBM50085415
NameBDBM50085415
Synonyms:3-(3,5-Dibromo-4-hydroxy-benzylidene)-5-iodo-1,3-dihydro-indol-2-one 3-[1-(3,5-Dibromo-4-hydroxy-phenyl)-meth-(Z)-ylidene]-5-iodo-1,3-dihydro-indol-2-one G6416 (GW5074) | GW-5074
TypeSmall organic molecule
Emp. Form.C15H8Br2INO2
Mol. Mass.520.942
SMILESOc1c(Br)cc(\C=C2/C(=O)Nc3ccc(I)cc23)cc1Br