Reaction Details
TargetMitogen-activated protein kinase 14
LigandBDBM50044784
Substrate/Competitorn/a
Meas. Tech.ChEMBL_1452617 (CHEMBL3363742)
IC50 8.7±n/a nM
Citation Kim, MLee, JJung, KKim, HAman, WRyu, JSHah, JM Design, synthesis and biological evaluation of benzyl 2-(1H-imidazole-1-yl) pyrimidine analogues as selective and potent Raf inhibitors. Bioorg Med Chem Lett24:3600-4 (2014) 
 
Mitogen-activated protein kinase 14
Name:Mitogen-activated protein kinase 14
Type:Serine/threonine-protein kinase
Mol. Mass.:41286.76
Organism:Homo sapiens (Human)
Description:Q16539
Residue:360
BDBM50044784
NameBDBM50044784
Synonyms:CHEBI:79090 US10865384, Compound SB202190
TypeSmall organic molecule
Emp. Form.C20H14FN3O
Mol. Mass.331.3431
SMILESOc1ccc(cc1)-c1nc(c([nH]1)-c1ccncc1)-c1ccc(F)cc1