Reaction Details
TargetNAD-dependent protein deacetylase sirtuin-1
LigandBDBM50044816
Substrate/Competitorn/a
Meas. Tech.ChEMBL_1454386 (CHEMBL3364858)
Ki 39100±n/a nM
Citation Wu, JLi, JXu, MHLiu, D Structure-activity relationship and interaction studies of new SIRT1 inhibitors with the scaffold of 3-(furan-2-yl)-[1,2,4]triazolo[3,4-b][1,3,4]thiadiazole. Bioorg Med Chem Lett24:3050-6 (2014) 
 
NAD-dependent protein deacetylase sirtuin-1
Name:NAD-dependent protein deacetylase sirtuin-1
Type:Developmental protein; hydrolase
Mol. Mass.:81626.66
Organism:Homo sapiens (Human)
Description:n/a
Residue:747
BDBM50044816
NameBDBM50044816
Synonyms:CHEMBL1576457
TypeSmall organic molecule
Emp. Form.C12H7N5OS
Mol. Mass.269.282
SMILESc1coc(c1)-c1nnc2sc(nn12)-c1ccccn1