Reaction Details
TargetFree fatty acid receptor 4
LigandBDBM50044873
Substrate/Competitorn/a
Meas. Tech.ChEMBL_1454419 (CHEMBL3364891)
EC50 316±n/a nM
Citation Sparks, SMChen, GCollins, JLDanger, DDock, STJayawickreme, CJenkinson, SLaudeman, CLeesnitzer, MALiang, XMaloney, PMcCoy, DCMoncol, DRash, VRimele, TVulimiri, PWay, JMRoss, S Identification of diarylsulfonamides as agonists of the free fatty acid receptor 4 (FFA4/GPR120). Bioorg Med Chem Lett24:3100-3 (2014) 
 
Free fatty acid receptor 4
Name:Free fatty acid receptor 4
Type:PROTEIN
Mol. Mass.:42256.91
Organism:Homo sapiens (Human)
Description:ChEMBL_1508994
Residue:377
BDBM50044873
NameBDBM50044873
Synonyms:CHEMBL3311327
TypeSmall organic molecule
Emp. Form.C18H21NO3S
Mol. Mass.331.429
SMILESCOc1ccc(cc1)S(=O)(=O)Nc1c(C)cc(CC=C)cc1C