Reaction Details
TargetTaste receptor type 2 member 16
LigandBDBM50044849
Substrate/Competitorn/a
Meas. Tech.ChEMBL_1456199 (CHEMBL3361954)
EC50<50119±n/a nM
Citation Sparks, SMChen, GCollins, JLDanger, DDock, STJayawickreme, CJenkinson, SLaudeman, CLeesnitzer, MALiang, XMaloney, PMcCoy, DCMoncol, DRash, VRimele, TVulimiri, PWay, JMRoss, S Identification of diarylsulfonamides as agonists of the free fatty acid receptor 4 (FFA4/GPR120). Bioorg Med Chem Lett24:3100-3 (2014) 
 
Taste receptor type 2 member 16
Name:Taste receptor type 2 member 16
Type:PROTEIN
Mol. Mass.:34001.15
Organism:Homo sapiens (Human)
Description:ChEMBL_109435
Residue:291
BDBM50044849
NameBDBM50044849
Synonyms:CHEMBL3311308
TypeSmall organic molecule
Emp. Form.C16H19NO3S
Mol. Mass.305.392
SMILESCOc1ccc(cc1)S(=O)(=O)Nc1c(C)cc(C)cc1C