Reaction Details
TargetVasopressin V1a receptor
LigandBDBM50044849
Substrate/Competitorn/a
Meas. Tech.ChEMBL_1456210 (CHEMBL3361965)
IC50<50119±n/a nM
Citation Sparks, SMChen, GCollins, JLDanger, DDock, STJayawickreme, CJenkinson, SLaudeman, CLeesnitzer, MALiang, XMaloney, PMcCoy, DCMoncol, DRash, VRimele, TVulimiri, PWay, JMRoss, S Identification of diarylsulfonamides as agonists of the free fatty acid receptor 4 (FFA4/GPR120). Bioorg Med Chem Lett24:3100-3 (2014) 
 
Vasopressin V1a receptor
Name:Vasopressin V1a receptor
Type:Receptor
Mol. Mass.:46820.18
Organism:Homo sapiens (Human)
Description:P37288
Residue:418
BDBM50044849
NameBDBM50044849
Synonyms:CHEMBL3311308
TypeSmall organic molecule
Emp. Form.C16H19NO3S
Mol. Mass.305.392
SMILESCOc1ccc(cc1)S(=O)(=O)Nc1c(C)cc(C)cc1C