Reaction Details
Target5-hydroxytryptamine receptor 2A
LigandBDBM50044849
Substrate/Competitorn/a
Meas. Tech.ChEMBL_1455268 (CHEMBL3362274)
EC50<39811±n/a nM
Citation Sparks, SMChen, GCollins, JLDanger, DDock, STJayawickreme, CJenkinson, SLaudeman, CLeesnitzer, MALiang, XMaloney, PMcCoy, DCMoncol, DRash, VRimele, TVulimiri, PWay, JMRoss, S Identification of diarylsulfonamides as agonists of the free fatty acid receptor 4 (FFA4/GPR120). Bioorg Med Chem Lett24:3100-3 (2014) 
 
5-hydroxytryptamine receptor 2A
Name:5-hydroxytryptamine receptor 2A
Type:undefined
Mol. Mass.:52607.65
Organism:Homo sapiens (Human)
Description:P28223
Residue:471
BDBM50044849
NameBDBM50044849
Synonyms:CHEMBL3311308
TypeSmall organic molecule
Emp. Form.C16H19NO3S
Mol. Mass.305.392
SMILESCOc1ccc(cc1)S(=O)(=O)Nc1c(C)cc(C)cc1C