Reaction Details
TargetApoptosis regulator Bcl-2
LigandBDBM50044949
Substrate/Competitorn/a
Meas. Tech.ChEMBL_1457123 (CHEMBL3369467)
IC50<10.0±n/a nM
Citation Varnes, JGGero, THuang, SDiebold, RBOgoe, CGrover, PTSu, MMukherjee, PSaeh, JCMacIntyre, TRepik, GDillman, KByth, KRussell, DJIoannidis, S Towards the next generation of dual Bcl-2/Bcl-xL inhibitors. Bioorg Med Chem Lett24:3026-33 (2014) 
 
Apoptosis regulator Bcl-2
Name:Apoptosis regulator Bcl-2
Type:Homodimer or heterodimer
Mol. Mass.:26269.11
Organism:Homo sapiens (Human)
Description:P10415
Residue:239
BDBM50044949
NameBDBM50044949
Synonyms:CHEMBL3309307
TypeSmall organic molecule
Emp. Form.C44H46ClF3N6O6S3
Mol. Mass.943.516
SMILESFC(F)(F)S(=O)(=O)c1cc(ccc1N[C@H](CCN1CCOCC1)CSc1ccccc1)S(=O)(=O)NC(=O)c1ccc(cc1)N1CCN(Cc2ccncc2-c2ccc(Cl)cc2)CC1