Reaction Details
TargetApoptosis regulator Bcl-2
LigandBDBM50044924
Substrate/Competitorn/a
Meas. Tech.ChEMBL_1457123 (CHEMBL3369467)
IC50<10.0±n/a nM
Citation Varnes, JGGero, THuang, SDiebold, RBOgoe, CGrover, PTSu, MMukherjee, PSaeh, JCMacIntyre, TRepik, GDillman, KByth, KRussell, DJIoannidis, S Towards the next generation of dual Bcl-2/Bcl-xL inhibitors. Bioorg Med Chem Lett24:3026-33 (2014) 
 
Apoptosis regulator Bcl-2
Name:Apoptosis regulator Bcl-2
Type:Homodimer or heterodimer
Mol. Mass.:26269.11
Organism:Homo sapiens (Human)
Description:P10415
Residue:239
BDBM50044924
NameBDBM50044924
Synonyms:CHEMBL3309311
TypeSmall organic molecule
Emp. Form.C49H54ClF3N6O8S3
Mol. Mass.1043.632
SMILESCN(C)C(=O)COc1cccc(c1CN1CCN(CC1)c1ccc(cc1)C(=O)NS(=O)(=O)c1ccc(N[C@H](CCN2CCOCC2)CSc2ccccc2)c(c1)S(=O)(=O)C(F)(F)F)-c1ccc(Cl)cc1