Reaction Details
TargetBcl-2-like protein 1
LigandBDBM50044922
Substrate/Competitorn/a
Meas. Tech.ChEMBL_1457124 (CHEMBL3369468)
IC50 11±n/a nM
Citation Varnes, JGGero, THuang, SDiebold, RBOgoe, CGrover, PTSu, MMukherjee, PSaeh, JCMacIntyre, TRepik, GDillman, KByth, KRussell, DJIoannidis, S Towards the next generation of dual Bcl-2/Bcl-xL inhibitors. Bioorg Med Chem Lett24:3026-33 (2014) 
 
Bcl-2-like protein 1
Name:Bcl-2-like protein 1
Type:Mitochondrion membrane; Single-pass membrane protein
Mol. Mass.:26039.60
Organism:Homo sapiens (Human)
Description:n/a
Residue:233
BDBM50044922
NameBDBM50044922
Synonyms:CHEMBL3311488
TypeSmall organic molecule
Emp. Form.C45H46ClF3N4O7S4
Mol. Mass.975.578
SMILES[O-][S@+](C1CCN(CC1)c1ccc(cc1)C(=O)NS(=O)(=O)c1ccc(N[C@H](CCN2CCOCC2)CSc2ccccc2)c(c1)S(=O)(=O)C(F)(F)F)c1ccccc1-c1ccc(Cl)cc1