Reaction Details
TargetBcl-2-like protein 1
LigandBDBM50044948
Substrate/Competitorn/a
Meas. Tech.ChEMBL_1457124 (CHEMBL3369468)
IC50 21±n/a nM
Citation Varnes, JGGero, THuang, SDiebold, RBOgoe, CGrover, PTSu, MMukherjee, PSaeh, JCMacIntyre, TRepik, GDillman, KByth, KRussell, DJIoannidis, S Towards the next generation of dual Bcl-2/Bcl-xL inhibitors. Bioorg Med Chem Lett24:3026-33 (2014) 
 
Bcl-2-like protein 1
Name:Bcl-2-like protein 1
Type:Mitochondrion membrane; Single-pass membrane protein
Mol. Mass.:26039.60
Organism:Homo sapiens (Human)
Description:n/a
Residue:233
BDBM50044948
NameBDBM50044948
Synonyms:CHEMBL3311494
TypeSmall organic molecule
Emp. Form.C43H45ClF3N7O6S3
Mol. Mass.944.504
SMILESFC(F)(F)S(=O)(=O)c1cc(ccc1N[C@H](CCN1CCOCC1)CSc1ccccc1)S(=O)(=O)NC(=O)c1ccc(cc1)N1CCN(Cc2ccccc2-c2ncc(Cl)cn2)CC1