Reaction Details
TargetMalate dehydrogenase
LigandBDBM50044967
Substrate/Competitorn/a
Meas. Tech.ChEMBL_1448377 (CHEMBL3376861)
IC50 500±n/a nM
Citation Zinglé, CTritsch, DGrosdemange-Billiard, CRohmer, M Catechol-rhodanine derivatives: Specific and promiscuous inhibitors of Escherichia coli deoxyxylulose phosphate reductoisomerase (DXR). Bioorg Med Chem22:3713-9 (2014) 
 
Malate dehydrogenase
Name:Malate dehydrogenase
Type:PROTEIN
Mol. Mass.:35423.44
Organism:Thermus thermophilus
Description:ChEMBL_1448377
Residue:327
BDBM50044967
NameBDBM50044967
Synonyms:CHEMBL3309759
TypeSmall organic molecule
Emp. Form.C24H17ClN2O5S2
Mol. Mass.512.985
SMILESOc1ccc(\C=C2/SC(=S)N(CC(=O)Nc3ccc(Oc4ccc(Cl)cc4)cc3)C2=O)cc1O