Reaction Details
TargetAcetylcholine receptor subunit alpha
LigandBDBM50045044
Substrate/Competitorn/a
Meas. Tech.ChEMBL_1454471 (CHEMBL3365586)
Ki 944±n/a nM
Citation Yu, LFZhang, HKCaldarone, BJEaton, JBLukas, RJKozikowski, AP Recent developments in novel antidepressants targetinga4ß2-nicotinic acetylcholine receptors. J Med Chem57:8204-23 (2014) 
 
Acetylcholine receptor subunit alpha
Name:Acetylcholine receptor subunit alpha
Type:Ion channel
Mol. Mass.:54542.01
Organism:Homo sapiens (Human)
Description:n/a
Residue:482
BDBM50045044
NameBDBM50045044
Synonyms:CHEMBL3341967
TypeSmall organic molecule
Emp. Form.C10H14ClN3
Mol. Mass.211.691
SMILESClc1cncc(c1)N1CCCNCC1