Reaction Details
TargetTyrosine-protein phosphatase non-receptor type 1
LigandBDBM50045053
Substrate/Competitorn/a
Meas. Tech.ChEMBL_1456270 (CHEMBL3367793)
IC50 22800±n/a nM
Citation Zhi, YGao, LXJin, YTang, CLLi, JYLi, JLong, YQ 4-Quinolone-3-carboxylic acids as cell-permeable inhibitors of protein tyrosine phosphatase 1B. Bioorg Med Chem22:3670-83 (2014) 
 
Tyrosine-protein phosphatase non-receptor type 1
Name:Tyrosine-protein phosphatase non-receptor type 1
Type:Protein phosphatase
Mol. Mass.:49963.76
Organism:Homo sapiens (Human)
Description:Human recombinant GST-fusion PTP1B (1-435).
Residue:435
BDBM50045053
NameBDBM50045053
Synonyms:CHEMBL3309776
TypeSmall organic molecule
Emp. Form.C24H25N3O3
Mol. Mass.403.4736
SMILESOC(=O)c1cn(C2CC2)c2ccc(cc2c1=O)N1CCN(Cc2ccccc2)CC1