Reaction Details
TargetTyrosine-protein phosphatase non-receptor type 1
LigandBDBM50045061
Substrate/Competitorn/a
Meas. Tech.ChEMBL_1456270 (CHEMBL3367793)
IC50 4620±n/a nM
Citation Zhi, YGao, LXJin, YTang, CLLi, JYLi, JLong, YQ 4-Quinolone-3-carboxylic acids as cell-permeable inhibitors of protein tyrosine phosphatase 1B. Bioorg Med Chem22:3670-83 (2014) 
 
Tyrosine-protein phosphatase non-receptor type 1
Name:Tyrosine-protein phosphatase non-receptor type 1
Type:Protein phosphatase
Mol. Mass.:49963.76
Organism:Homo sapiens (Human)
Description:Human recombinant GST-fusion PTP1B (1-435).
Residue:435
BDBM50045061
NameBDBM50045061
Synonyms:CHEMBL3309790
TypeSmall organic molecule
Emp. Form.C21H14INO7
Mol. Mass.519.2428
SMILESOC(=O)C(\O)=C\C(=O)c1cccc(Cn2cc(C(O)=O)c(=O)c3cc(I)ccc23)c1