Reaction Details
TargetTyrosine-protein phosphatase non-receptor type 2
LigandBDBM50045060
Substrate/Competitorn/a
Meas. Tech.ChEMBL_1456272 (CHEMBL3367795)
IC50 11500±n/a nM
Citation Zhi, YGao, LXJin, YTang, CLLi, JYLi, JLong, YQ 4-Quinolone-3-carboxylic acids as cell-permeable inhibitors of protein tyrosine phosphatase 1B. Bioorg Med Chem22:3670-83 (2014) 
 
Tyrosine-protein phosphatase non-receptor type 2
Name:Tyrosine-protein phosphatase non-receptor type 2
Type:Protein
Mol. Mass.:48481.80
Organism:Homo sapiens (Human)
Description:P17706
Residue:415
BDBM50045060
NameBDBM50045060
Synonyms:CHEMBL3309789
TypeSmall organic molecule
Emp. Form.C23H18INO7
Mol. Mass.547.296
SMILESCCOC(=O)C(\O)=C\C(=O)c1cccc(Cn2cc(C(O)=O)c(=O)c3cc(I)ccc23)c1