Reaction Details
TargetIntegrase
LigandBDBM50045065
Substrate/Competitorn/a
Meas. Tech.ChEMBL_1457167 (CHEMBL3369753)
IC50 28±n/a nM
Citation Johns, BAKawasuji, TWeatherhead, JGBoros, EEThompson, JBKoble, CSGarvey, EPFoster, SAJeffrey, JLFujiwara, T Naphthyridinone (NTD) integrase inhibitors 4. Investigating N1 acetamide substituent effects with C3 amide groups. Bioorg Med Chem Lett24:3104-7 (2014) 
 
Integrase
Name:Integrase
Synonyms:pol
Type:PROTEIN
Mol. Mass.:32203.43
Organism:Human immunodeficiency virus 1
Description:ChEMBL_106649
Residue:288
BDBM50045065
NameBDBM50045065
Synonyms:CHEMBL3310415
TypeSmall organic molecule
Emp. Form.C26H30FN5O5
Mol. Mass.511.5453
SMILESCOCCNC(=O)c1c(O)c2ncc(Cc3ccc(F)cc3)cc2n(CC(=O)N2CCN(C)CC2)c1=O