Reaction Details
TargetIntegrase
LigandBDBM50045078
Substrate/Competitorn/a
Meas. Tech.ChEMBL_1457167 (CHEMBL3369753)
IC50 7.7±n/a nM
Citation Johns, BAKawasuji, TWeatherhead, JGBoros, EEThompson, JBKoble, CSGarvey, EPFoster, SAJeffrey, JLFujiwara, T Naphthyridinone (NTD) integrase inhibitors 4. Investigating N1 acetamide substituent effects with C3 amide groups. Bioorg Med Chem Lett24:3104-7 (2014) 
 
Integrase
Name:Integrase
Synonyms:pol
Type:PROTEIN
Mol. Mass.:32203.43
Organism:Human immunodeficiency virus 1
Description:ChEMBL_106649
Residue:288
BDBM50045078
NameBDBM50045078
Synonyms:CHEMBL3310095
TypeSmall organic molecule
Emp. Form.C21H21FN4O5
Mol. Mass.428.4136
SMILESCOCCNC(=O)c1c(O)c2ncc(Cc3ccc(F)cc3)cc2n(CC(N)=O)c1=O