Reaction Details
TargetIntegrase
LigandBDBM50045080
Substrate/Competitorn/a
Meas. Tech.ChEMBL_1457167 (CHEMBL3369753)
IC50 6.8±n/a nM
Citation Johns, BAKawasuji, TWeatherhead, JGBoros, EEThompson, JBKoble, CSGarvey, EPFoster, SAJeffrey, JLFujiwara, T Naphthyridinone (NTD) integrase inhibitors 4. Investigating N1 acetamide substituent effects with C3 amide groups. Bioorg Med Chem Lett24:3104-7 (2014) 
 
Integrase
Name:Integrase
Synonyms:pol
Type:PROTEIN
Mol. Mass.:32203.43
Organism:Human immunodeficiency virus 1
Description:ChEMBL_106649
Residue:288
BDBM50045080
NameBDBM50045080
Synonyms:CHEMBL3310082
TypeSmall organic molecule
Emp. Form.C22H23FN4O5
Mol. Mass.442.4402
SMILESCNC(=O)c1c(O)c2ncc(Cc3ccc(F)cc3)cc2n(CC(=O)NCCOC)c1=O